Reaction Details
TargetLysine-specific histone demethylase 1A
LigandBDBM101259
Substrate/Competitorn/a
Meas. Tech.Biological Assay
Ki 221±n/a nM
Citation Guibourt, NMunoz, AOLaria, JC Oxidase inhibitors and their use US Patent US8524717 Publication Date 9/3/2013
 
Lysine-specific histone demethylase 1A
Name:Lysine-specific histone demethylase 1A
Type:Enzyme
Mol. Mass.:92901.01
Organism:Homo sapiens (Human)
Description:O60341
Residue:852
BDBM101259
NameBDBM101259
Synonyms:US8524717, 14
TypeSmall organic molecule
Emp. Form.C17H25N3O
Mol. Mass.287.3999
SMILESCN(C)[C@H]1CCN(C1)C(=O)CN[C@H]1C[C@@H]1c1ccccc1