Reaction Details
TargetLysine-specific histone demethylase 1A
LigandBDBM101262
Substrate/Competitorn/a
Meas. Tech.Biological Assay
Ki 72±n/a nM
Citation Guibourt, NMunoz, AOLaria, JC Oxidase inhibitors and their use US Patent US8524717 Publication Date 9/3/2013
 
Lysine-specific histone demethylase 1A
Name:Lysine-specific histone demethylase 1A
Type:Enzyme
Mol. Mass.:92901.01
Organism:Homo sapiens (Human)
Description:O60341
Residue:852
BDBM101262
NameBDBM101262
Synonyms:US8524717, 17 | US8524717, 32
TypeSmall organic molecule
Emp. Form.C15H21N3O
Mol. Mass.259.3467
SMILESO=C(CN[C@H]1C[C@@H]1c1ccccc1)N[C@H]1CCNC1