Reaction Details
TargetLysine-specific histone demethylase 1A
LigandBDBM101280
Substrate/Competitorn/a
Meas. Tech.Biological Assay
Ki 390±n/a nM
Citation Guibourt, NMunoz, AOLaria, JC Oxidase inhibitors and their use US Patent US8524717 Publication Date 9/3/2013
 
Lysine-specific histone demethylase 1A
Name:Lysine-specific histone demethylase 1A
Type:Enzyme
Mol. Mass.:92901.01
Organism:Homo sapiens (Human)
Description:O60341
Residue:852
BDBM101280
NameBDBM101280
Synonyms:US8524717, 35
TypeSmall organic molecule
Emp. Form.C29H33N3O2
Mol. Mass.455.5912
SMILESCN1CCN(CC1)C(=O)CN[C@H]1C[C@@H]1c1ccc(OCc2ccc(cc2)-c2ccccc2)cc1