Reaction Details
TargetLysine-specific histone demethylase 1A
LigandBDBM101283
Substrate/Competitorn/a
Meas. Tech.Biological Assay
Ki 25±n/a nM
Citation Guibourt, NMunoz, AOLaria, JC Oxidase inhibitors and their use US Patent US8524717 Publication Date 9/3/2013
 
Lysine-specific histone demethylase 1A
Name:Lysine-specific histone demethylase 1A
Type:Enzyme
Mol. Mass.:92901.01
Organism:Homo sapiens (Human)
Description:O60341
Residue:852
BDBM101283
NameBDBM101283
Synonyms:US8524717, 38
TypeSmall organic molecule
Emp. Form.C23H29N3O2
Mol. Mass.379.4953
SMILESCOc1cccc(c1)-c1ccc(cc1)[C@H]1C[C@@H]1NCC(=O)N1CCN(C)CC1