Reaction Details
TargetLysine-specific histone demethylase 1A
LigandBDBM101292
Substrate/Competitorn/a
Meas. Tech.Biological Assay
Ki 135±n/a nM
Citation Guibourt, NMunoz, AOLaria, JC Oxidase inhibitors and their use US Patent US8524717 Publication Date 9/3/2013
 
Lysine-specific histone demethylase 1A
Name:Lysine-specific histone demethylase 1A
Type:Enzyme
Mol. Mass.:92901.01
Organism:Homo sapiens (Human)
Description:O60341
Residue:852
BDBM101292
NameBDBM101292
Synonyms:US8524717, 47
TypeSmall organic molecule
Emp. Form.C22H28N4O2
Mol. Mass.380.4833
SMILESCOc1ccc(cn1)-c1ccc(cc1)[C@H]1C[C@@H]1NCC(=O)N1CCN(C)CC1