Reaction Details
TargetLysine-specific histone demethylase 1A
LigandBDBM101297
Substrate/Competitorn/a
Meas. Tech.Biological Assay
Ki 40±n/a nM
Citation Guibourt, NMunoz, AOLaria, JC Oxidase inhibitors and their use US Patent US8524717 Publication Date 9/3/2013
 
Lysine-specific histone demethylase 1A
Name:Lysine-specific histone demethylase 1A
Type:Enzyme
Mol. Mass.:92901.01
Organism:Homo sapiens (Human)
Description:O60341
Residue:852
BDBM101297
NameBDBM101297
Synonyms:US8524717, 52
TypeSmall organic molecule
Emp. Form.C22H26FN3O
Mol. Mass.367.4597
SMILESCN1CCN(CC1)C(=O)CN[C@H]1C[C@@H]1c1ccc(cc1)-c1cccc(F)c1