Reaction Details
TargetMu-type opioid receptor
LigandBDBM3916
Substrate/Competitorn/a
Meas. Tech.Binding Assay
Ki 1.22±0 nM
Citation Kyle, DJGoehring, RRFundytus, ME Buprenophine analogs US Patent US8530494 Publication Date 9/10/2013
 
Mu-type opioid receptor
Name:Mu-type opioid receptor
Type:G Protein-Coupled Receptor (GPCR)
Mol. Mass.:44789.51
Organism:Homo sapiens (Human)
Description:P35372
Residue:400
BDBM3916
NameBDBM3916
Synonyms:US8530494, 206
Typen/a
Emp. Form.C29H33Cl2NO4
Mol. Mass.530.483
SMILESCOc1ccc2C[C@H]3N(C)CC[C@@]45[C@@H](Oc1c24)[C@]1(CC[C@@]35C[C@@H]1COCc1ccc(Cl)c(Cl)c1)OC