Reaction Details
TargetSerine/threonine-protein kinase PAK 4
LigandBDBM101479
Substrate/Competitorn/a
Meas. Tech.Enzymatic Assay
Ki 2.8±n/a nM
EC50 0.94±0 nM
Citation Zhang, JGuo, CBouzida, DDong, LLi, HMarakovits, JTYang, AHong, Y Pyrrolopyrazoles, potent kinase inhibitors US Patent US8530652 Publication Date 9/10/2013
 
Serine/threonine-protein kinase PAK 4
Name:Serine/threonine-protein kinase PAK 4
Type:Protein
Mol. Mass.:64098.01
Organism:Homo sapiens (Human)
Description:O96013
Residue:591
BDBM101479
NameBDBM101479
Synonyms:US8524710, 56 US8530652, 6
TypeSmall organic molecule
Emp. Form.C24H27ClN8OS
Mol. Mass.511.042
SMILESCN(C)C[C@@H](NC(=O)N1Cc2c(Nc3nc(Cl)nc4ccsc34)n[nH]c2C1(C)C)c1ccccc1