Reaction Details
TargetSerine/threonine-protein kinase PAK 4
LigandBDBM101506
Substrate/Competitorn/a
Meas. Tech.Enzymatic Assay
Ki 47±n/a nM
EC50 618±0 nM
Citation Zhang, JGuo, CBouzida, DDong, LLi, HMarakovits, JTYang, AHong, Y Pyrrolopyrazoles, potent kinase inhibitors US Patent US8530652 Publication Date 9/10/2013
 
Serine/threonine-protein kinase PAK 4
Name:Serine/threonine-protein kinase PAK 4
Type:Protein
Mol. Mass.:64098.01
Organism:Homo sapiens (Human)
Description:O96013
Residue:591
BDBM101506
NameBDBM101506
Synonyms:US8524710, 85 US8530652, 78
TypeSmall organic molecule
Emp. Form.C22H22N8O
Mol. Mass.414.4631
SMILESCC1(C)N(Cc2c(Nc3ccnc(n3)C#N)[nH]nc12)C(=O)N[C@@H]1C[C@H]1c1ccccc1