Reaction Details
TargetSerine/threonine-protein kinase PAK 4
LigandBDBM101514
Substrate/Competitorn/a
Meas. Tech.Enzymatic Assay
Ki 24±n/a nM
EC50 147±0 nM
Citation Zhang, JGuo, CBouzida, DDong, LLi, HMarakovits, JTYang, AHong, Y Pyrrolopyrazoles, potent kinase inhibitors US Patent US8530652 Publication Date 9/10/2013
 
Serine/threonine-protein kinase PAK 4
Name:Serine/threonine-protein kinase PAK 4
Type:Protein
Mol. Mass.:64098.01
Organism:Homo sapiens (Human)
Description:O96013
Residue:591
BDBM101514
NameBDBM101514
Synonyms:US8524699, 22 US8530652, 86
TypeSmall organic molecule
Emp. Form.C24H25N7OS
Mol. Mass.459.567
SMILESCc1nc(Nc2[nH]nc3c2CN(C(=O)N[C@H]2C[C@@H]2c2ccccc2)C3(C)C)c2sccc2n1