Reaction Details
TargetSerine/threonine-protein kinase PAK 4
LigandBDBM101552
Substrate/Competitorn/a
Meas. Tech.Enzymatic Assay
Ki 39±n/a nM
EC50>3.9±0.0 nM
Citation Zhang, JGuo, CBouzida, DDong, LLi, HMarakovits, JTYang, AHong, Y Pyrrolopyrazoles, potent kinase inhibitors US Patent US8530652 Publication Date 9/10/2013
 
Serine/threonine-protein kinase PAK 4
Name:Serine/threonine-protein kinase PAK 4
Type:Protein
Mol. Mass.:64098.01
Organism:Homo sapiens (Human)
Description:O96013
Residue:591
BDBM101552
NameBDBM101552
Synonyms:US8530494, 214 US8530652, 79
TypeSmall organic molecule
Emp. Form.C23H28FN7O3
Mol. Mass.469.5119
SMILESCOc1ncc(F)c(Nc2[nH]nc3c2CN(C(=O)O[C@H](CN(C)C)c2ccccc2)C3(C)C)n1