Reaction Details
TargetCorticotropin-releasing factor receptor 1
LigandBDBM101685
Substrate/Competitorn/a
Meas. Tech.Binding Assay
IC50 32±0.0 nM
Citation Shin, KTerauchi, TTakahashi, YHashizume, MTakeda, KShikata, KInomata, A Pyrazolothiazole compound US Patent US8530504 Publication Date 9/10/2013
 
Corticotropin-releasing factor receptor 1
Name:Corticotropin-releasing factor receptor 1
Type:Enzyme
Mol. Mass.:50744.31
Organism:Homo sapiens (Human)
Description:P34998
Residue:444
BDBM101685
NameBDBM101685
Synonyms:US8530504, 47
TypeSmall organic molecule
Emp. Form.C26H35N3O5S
Mol. Mass.501.638
SMILESCCOCc1cc(OC)c(-c2csc3c(N(CC4CCC4)C4CCOC4)c(OC)nn23)c(OC)c1