Reaction Details
TargetIsoform 3 of Acetyl-CoA carboxylase 2 (ACC2.v2)
LigandBDBM102069
Substrate/Competitorn/a
Meas. Tech.Enzyme Assay
IC50 5e+1±n/a nM
Citation Fleck, MNosse, BHeine, NRoth, GJ Azetidine derivatives US Patent US8530460 Publication Date 9/10/2013
 
Isoform 3 of Acetyl-CoA carboxylase 2 (ACC2.v2)
Name:Isoform 3 of Acetyl-CoA carboxylase 2 (ACC2.v2)
Type:Protein
Mol. Mass.:255085.30
Organism:Homo sapiens (Human)
Description:AJ575592.3
Residue:2256
BDBM102069
NameBDBM102069
Synonyms:US8530460, 8.7
TypeSmall organic molecule
Emp. Form.C23H26N4O3
Mol. Mass.406.4775
SMILESCCOc1ccc(cc1)N1CC(C1)Oc1ccc(cc1)[C@H](C)NC(=O)c1cn[nH]c1