Reaction Details
TargetC-C chemokine receptor type 1
LigandBDBM102327
Substrate/Competitorn/a
Meas. Tech.Scintillation Proximity Assay (SPA)
IC50 1.0±0.0 nM
Citation Santella, JBHynes, JGardner, DS Piperidine derivatives as modulators of chemokine receptor activity US Patent US8536198 Publication Date 9/17/2013
 
C-C chemokine receptor type 1
Name:C-C chemokine receptor type 1
Type:Enzyme
Mol. Mass.:41180.69
Organism:Homo sapiens (Human)
Description:P32246
Residue:355
BDBM102327
NameBDBM102327
Synonyms:US8536198, 80
TypeSmall organic molecule
Emp. Form.C26H32ClN3O5S
Mol. Mass.534.067
SMILESCC1(C)CN(CC[C@]1(O)c1ccc(Cl)cc1)C(=O)[C@H]1CCC[C@H]1NC(=O)c1cccc(c1)S(N)(=O)=O