Reaction Details
TargetC-C chemokine receptor type 1
LigandBDBM102329
Substrate/Competitorn/a
Meas. Tech.Scintillation Proximity Assay (SPA)
IC50 1.5±0.0 nM
Citation Santella, JBHynes, JGardner, DS Piperidine derivatives as modulators of chemokine receptor activity US Patent US8536198 Publication Date 9/17/2013
 
C-C chemokine receptor type 1
Name:C-C chemokine receptor type 1
Type:Enzyme
Mol. Mass.:41180.69
Organism:Homo sapiens (Human)
Description:P32246
Residue:355
BDBM102329
NameBDBM102329
Synonyms:US8536198, 84
TypeSmall organic molecule
Emp. Form.C25H35ClN2O4
Mol. Mass.463.009
SMILESCC1(C)CN(CC[C@]1(O)c1ccc(Cl)cc1)C(=O)[C@H]1CCC[C@H]1NC(=O)[C@H]1CC[C@@H](O)C1