Reaction Details
TargetMu-type opioid receptor
LigandBDBM102406
Substrate/Competitorn/a
Meas. Tech.Binding Assay
Temperature298.15±0 K
Ki 1.58±0.0 nM
Citation Inagaki, MHara, SHaga, NTamura, YGoto, YHasegawa, T 6,7-unsaturated-7-carbamoyl substituted morphinan derivative US Patent US8536192 Publication Date 9/17/2013
 
Mu-type opioid receptor
Name:Mu-type opioid receptor
Type:G Protein-Coupled Receptor (GPCR)
Mol. Mass.:44503.11
Organism:Rattus norvegicus (rat)
Description:Competition binding assays were carried out using membrane preparations from transfected HN9.10 cells that constitutively expressed the mu opioid receptor.
Residue:398
BDBM102406
NameBDBM102406
Synonyms:US8536192, I-135
TypeSmall organic molecule
Emp. Form.C26H30N2O7
Mol. Mass.482.5256
SMILESCOC(=O)C1(CC1)NC(=O)C1=C(O)[C@@H]2Oc3c4c(C[C@H]5N(CC6CC6)CC[C@@]24[C@@]5(O)C1)ccc3O