Reaction Details
TargetGlutamate receptor ionotropic, NMDA 2B
LigandBDBM280730
Substrate/Competitorn/a
Meas. Tech.NR2B Antagonist Activity
Temperature298.15±n/a K
IC50 23.0±n/a nM
Commentsextracted
Citation Shapiro, G Difluoroethylpyridine derivatives as NR2B NMDA receptor antagonists US Patent US10030026 Publication Date 7/24/2018
 
Glutamate receptor ionotropic, NMDA 2B
Name:Glutamate receptor ionotropic, NMDA 2B
Type:PROTEIN
Mol. Mass.:166375.46
Organism:Homo sapiens (Human)
Description:ChEMBL_1438829
Residue:1484
BDBM280730
NameBDBM280730
Synonyms:US10030026, Compound C-12
TypeSmall organic molecule
Emp. Form.C18H19F4N7O
Mol. Mass.425.3834
SMILESFC(F)Oc1ccc(nc1)C(F)(F)CN1CCC(CC1)Nc1ncnc2[nH]ncc12