Reaction Details
TargetProstaglandin D2 receptor 2
LigandBDBM102441
Substrate/Competitorn/a
Meas. Tech.Radioligand Binding Assay
Ki 258±0.0 nM
Citation Armer, REPettipher, ERWhittaker, MWynne, GMVile, JSchroer, F Compounds having CRTH2 antagonist activity US Patent US8536158 Publication Date 9/17/2013
 
Prostaglandin D2 receptor 2
Name:Prostaglandin D2 receptor 2
Type:Enzyme
Mol. Mass.:43295.45
Organism:Homo sapiens (Human)
Description:Q9Y5Y4
Residue:395
BDBM102441
NameBDBM102441
Synonyms:US8536158, E
TypeSmall organic molecule
Emp. Form.C17H15FN2O2
Mol. Mass.298.3116
SMILESCc1c(Cc2cccnc2)c2cc(F)ccc2n1CC(O)=O