Reaction Details
TargetFibroblast growth factor receptor 3
LigandBDBM102534
Substrate/Competitorn/a
Meas. Tech.Kinase Assay
IC50 10±0.0 nM
Citation Furet, PGraus Porta, DGuagnano, V Quinoxaline carboxamide derivatives as protein tyrosine kinase inhibitors US Patent US8536175 Publication Date 9/17/2013
 
Fibroblast growth factor receptor 3
Name:Fibroblast growth factor receptor 3
Type:Protein
Mol. Mass.:87699.57
Organism:Homo sapiens (Human)
Description:P22607
Residue:806
BDBM102534
NameBDBM102534
Synonyms:US8536175, 124
TypeSmall organic molecule
Emp. Form.C28H28F2N6O3
Mol. Mass.534.5571
SMILESCOc1cc(OC)c(F)c(c1F)-c1ccc(C(=O)Nc2ccc(CN3CCN(C)CC3)cn2)c2nccnc12