Reaction Details
TargetMitogen-activated protein kinase 8
LigandBDBM102571
Substrate/Competitorn/a
Meas. Tech.In Vitro Inhibition Assay
pH7.5±0
IC50 6.8±n/a nM
Citation Gong, LHan, XMakra, FPalmer, WSRaptova, L Inhibitors of JNK US Patent US8536172 Publication Date 9/17/2013
 
Mitogen-activated protein kinase 8
Name:Mitogen-activated protein kinase 8
Type:Enzyme
Mol. Mass.:48297.57
Organism:Homo sapiens (Human)
Description:JNK-1 was purchased from Upstate Cell Signaling Solutions (formerly Upstate Biotechnology).
Residue:427
BDBM102571
NameBDBM102571
Synonyms:US8536172, I-20
TypeSmall organic molecule
Emp. Form.C27H35N5O4S
Mol. Mass.525.663
SMILESCCOC(=O)[C@H]1CC[C@@H](CC1)Nc1nccc(n1)-n1ccc2c(cccc12)N1CCC(CC1)S(C)(=O)=O