Reaction Details
TargetMitogen-activated protein kinase 8
LigandBDBM102576
Substrate/Competitorn/a
Meas. Tech.In Vitro Inhibition Assay
pH7.5±0
IC50 4.2±n/a nM
Citation Gong, LHan, XMakra, FPalmer, WSRaptova, L Inhibitors of JNK US Patent US8536172 Publication Date 9/17/2013
 
Mitogen-activated protein kinase 8
Name:Mitogen-activated protein kinase 8
Type:Enzyme
Mol. Mass.:48297.57
Organism:Homo sapiens (Human)
Description:JNK-1 was purchased from Upstate Cell Signaling Solutions (formerly Upstate Biotechnology).
Residue:427
BDBM102576
NameBDBM102576
Synonyms:US8536172, I-25
TypeSmall organic molecule
Emp. Form.C30H38N8O2
Mol. Mass.542.6751
SMILESO[C@@H]1CCN(C[C@H]2CC[C@@H](CC2)Nc2nccc(n2)-n2ccc3c(cccc23)N2CCN(CC2)C(=O)CC#N)C1