Reaction Details
TargetMitogen-activated protein kinase 8
LigandBDBM102602
Substrate/Competitorn/a
Meas. Tech.In Vitro Inhibition Assay
pH7.5±0
IC50 3.6±n/a nM
Citation Gong, LHan, XMakra, FPalmer, WSRaptova, L Inhibitors of JNK US Patent US8536172 Publication Date 9/17/2013
 
Mitogen-activated protein kinase 8
Name:Mitogen-activated protein kinase 8
Type:Enzyme
Mol. Mass.:48297.57
Organism:Homo sapiens (Human)
Description:JNK-1 was purchased from Upstate Cell Signaling Solutions (formerly Upstate Biotechnology).
Residue:427
BDBM102602
NameBDBM102602
Synonyms:US8536172, I-51
TypeSmall organic molecule
Emp. Form.C31H36F3N9O3S
Mol. Mass.671.736
SMILESCS(=O)(=O)C1CCN(CC1)c1cccc2n(ccc12)-c1ccnc(N[C@H]2CC[C@@H](CC2)C(=O)N2CCn3c(C2)nnc3C(F)(F)F)n1