Reaction Details
TargetActivin receptor type-1
LigandBDBM50262685
Substrate/Competitorn/a
IC50 9.76±0.0 nM
Citation Mohedas, AHXing, XArmstrong, KABullock, ANCuny, GDYu, PB Development of an ALK2-Biased BMP Type I Receptor Kinase Inhibitor. ACS Chem Biol8:1291-302 (2013) 
 
Activin receptor type-1
Name:Activin receptor type-1
Type:Protein
Mol. Mass.:57231.35
Organism:Mus musculus
Description:n/a
Residue:509
BDBM50262685
NameBDBM50262685
Synonyms:6-(4-(2-(piperidin-1-yl)ethoxy)phenyl)-3-(pyridin-4-yl)pyrazolo[1,5-a]pyrimidine CHEMBL478629 US9040694, Dorsomorphin
TypeSmall organic molecule
Emp. Form.C24H25N5O
Mol. Mass.399.4882
SMILESC(CN1CCCCC1)Oc1ccc(cc1)-c1cnc2c(cnn2c1)-c1ccncc1