Reaction Details
TargetTumor necrosis factor
LigandBDBM102663
Substrate/Competitorn/a
Meas. Tech.Inhibition Assay
Ki 0.0556±0.0 nM
IC50 65±0.0 nM
Citation Kozlowski, JAYu, WWong, MKKim, SHTong, LLavey, BJShankar, BBYang, DFeltz, RKosinski, AMZhou, GRizvi, RKDai, CFire, LGirijavallabhan, VLi, DPopovici-Muller, JRichard, JERosner, KESiddiqui, MAYang, L Compounds for the treatment of inflammatory disorders US Patent US8541572 Publication Date 9/24/2013
 
Tumor necrosis factor
Name:Tumor necrosis factor
Type:Enzyme
Mol. Mass.:25645.11
Organism:Homo sapiens (Human)
Description:P01375
Residue:233
BDBM102663
NameBDBM102663
Synonyms:US8541572, 970
TypeSmall organic molecule
Emp. Form.C31H23N5O5
Mol. Mass.545.5448
SMILESCOc1ccc2CN(C[C@]3(NC(=O)NC3=O)C#Cc3ccc(cc3)-c3nc(ccc3O)-c3ccncc3)C(=O)c2c1