Reaction Details
TargetTumor necrosis factor
LigandBDBM102890
Substrate/Competitorn/a
Meas. Tech.Inhibition Assay
Ki 0.42±0.0 nM
IC50 139±0.0 nM
Citation Kozlowski, JAYu, WWong, MKKim, SHTong, LLavey, BJShankar, BBYang, DFeltz, RKosinski, AMZhou, GRizvi, RKDai, CFire, LGirijavallabhan, VLi, DPopovici-Muller, JRichard, JERosner, KESiddiqui, MAYang, L Compounds for the treatment of inflammatory disorders US Patent US8541572 Publication Date 9/24/2013
 
Tumor necrosis factor
Name:Tumor necrosis factor
Type:Enzyme
Mol. Mass.:25645.11
Organism:Homo sapiens (Human)
Description:P01375
Residue:233
BDBM102890
NameBDBM102890
Synonyms:CHEMBL1288211 | US8541572, 2283
TypeSmall organic molecule
Emp. Form.C23H20N4O5
Mol. Mass.432.4287
SMILESCOc1ccc2CN(C[C@]3(NC(=O)NC3=O)C#Cc3ccc(CC(N)=O)cc3)C(=O)c2c1