Reaction Details
TargetGuanylate cyclase soluble subunit alpha-1
LigandBDBM280826
Substrate/Competitorn/a
Meas. Tech.sGC Binding Assay
pH7.4±n/a
Ki 0.056±n/a nM
Commentsextracted
Citation Berger, RChen, YLi, GGarfunkle, JLi, HMiao, SRaghavan, SSmith, CJStelmach, JWhitehead, AZhang, RZhang, YFu, JJi, GJiang, F Soluble guanylate cyclase stimulators US Patent US10030027 Publication Date 7/24/2018
 
Guanylate cyclase soluble subunit alpha-1
Name:Guanylate cyclase soluble subunit alpha-1
Type:Enzyme
Mol. Mass.:77457.21
Organism:Homo sapiens (Human)
Description:Q02108
Residue:690
BDBM280826
NameBDBM280826
Synonyms:(S)—N-((2H-Tetrazol-5-yl)methyl)-3-(4-{4-amino-2-[1-(2-fluorobenzyl)-1H-pyrazolo[3,4-b]pyridin-3-yl]-5-methyl-6-oxo-6,7-dihydro-5H-pyrrolo[2,3-d]pyrimidin-5-yl}phenyl)propanamide US10428076, Example 108B
TypeSmall organic molecule
Emp. Form.C31H27FN12O2
Mol. Mass.618.6237
SMILESC[C@]1(C(=O)Nc2nc(nc(N)c12)-c1nn(Cc2ccccc2F)c2ncccc12)c1ccc(CCC(=O)NCc2nn[nH]n2)cc1