Reaction Details
TargetGuanylate cyclase soluble subunit alpha-1
LigandBDBM280844
Substrate/Competitorn/a
Meas. Tech.sGC Binding Assay
pH7.4±n/a
Ki 0.077±n/a nM
Commentsextracted
Citation Berger, RChen, YLi, GGarfunkle, JLi, HMiao, SRaghavan, SSmith, CJStelmach, JWhitehead, AZhang, RZhang, YFu, JJi, GJiang, F Soluble guanylate cyclase stimulators US Patent US10030027 Publication Date 7/24/2018
 
Guanylate cyclase soluble subunit alpha-1
Name:Guanylate cyclase soluble subunit alpha-1
Type:Enzyme
Mol. Mass.:77457.21
Organism:Homo sapiens (Human)
Description:Q02108
Residue:690
BDBM280844
NameBDBM280844
Synonyms:3-{2-[4-amino-5-methyl- 2-{1-[4- methylcyclohexylmethyl]- 1H-pyrazolo[3,4- b]pyridin-3-yl}-6-oxo-6,7- dihydro-5H-pyrrolo[2,3- d]pyrimidin-5-yl]-1,3- oxazol-4-yl}-2,2- dimethylpropanoic acid US10030027, Example 126AB | US10428076, Example 126AB
TypeSmall organic molecule
Emp. Form.C29H34N8O4
Mol. Mass.558.6315
SMILESCC1CCC(Cn2nc(-c3nc4NC(=O)C(C)(c5nc(CC(C)(C)C(O)=O)co5)c4c(N)n3)c3cccnc23)CC1