Reaction Details
TargetGuanylate cyclase soluble subunit alpha-1
LigandBDBM280939
Substrate/Competitorn/a
Meas. Tech.sGC Binding Assay
pH7.4±n/a
Ki 0.067±n/a nM
Commentsextracted
Citation Berger, RChen, YLi, GGarfunkle, JLi, HMiao, SRaghavan, SSmith, CJStelmach, JWhitehead, AZhang, RZhang, YFu, JJi, GJiang, F Soluble guanylate cyclase stimulators US Patent US10030027 Publication Date 7/24/2018
 
Guanylate cyclase soluble subunit alpha-1
Name:Guanylate cyclase soluble subunit alpha-1
Type:Enzyme
Mol. Mass.:77457.21
Organism:Homo sapiens (Human)
Description:Q02108
Residue:690
BDBM280939
NameBDBM280939
Synonyms:(2E)-3-(4-{4- amino-2-[1-(2- fluorobenzyl)-1H- pyrazolo[3,4-b] pyridin-3-yl]-5- methyl-6-oxo- 6,7-dihydro-5H- pyrrolo[2,3-d] pyrimidin-5-yl} phenyl)prop-2- enoic acid US10428076, Example 217A
TypeSmall organic molecule
Emp. Form.C29H22FN7O3
Mol. Mass.535.5285
SMILESCC1(C(=O)Nc2nc(nc(N)c12)-c1nn(Cc2ccccc2F)c2ncccc12)c1ccc(\C=C\C(O)=O)cc1