Reaction Details
TargetGuanylate cyclase soluble subunit alpha-1
LigandBDBM280973
Substrate/Competitorn/a
Meas. Tech.sGC Binding Assay
pH7.4±n/a
Ki 0.048±n/a nM
Commentsextracted
Citation Berger, RChen, YLi, GGarfunkle, JLi, HMiao, SRaghavan, SSmith, CJStelmach, JWhitehead, AZhang, RZhang, YFu, JJi, GJiang, F Soluble guanylate cyclase stimulators US Patent US10030027 Publication Date 7/24/2018
 
Guanylate cyclase soluble subunit alpha-1
Name:Guanylate cyclase soluble subunit alpha-1
Type:Enzyme
Mol. Mass.:77457.21
Organism:Homo sapiens (Human)
Description:Q02108
Residue:690
BDBM280973
NameBDBM280973
Synonyms:4-Amino-2-[1-(2-fluorobenzyl)-1H-indazol-3-yl]-5-methyl-5-{4-[2-methyl-2-(2H-tetrazol-5-yl)propyl]oxazol-2-yl}-5,7-dihydro-6H-pyrrolo[2,3-d]pyrimidin-6-one US10428076, Example 248B
TypeSmall organic molecule
Emp. Form.C29H26FN11O2
Mol. Mass.579.5876
SMILESCC(C)(Cc1coc(n1)C1(C)C(=O)Nc2nc(nc(N)c12)-c1nn(Cc2ccccc2F)c2ccccc12)c1nn[nH]n1