Reaction Details
TargetBeta-secretase 1
LigandBDBM9489
Substrate/Competitorn/a
Meas. Tech.Time-Resolved FRET Assay
Ki 8.9±n/a nM
IC50 42±n/a nM
Citation Stamford, AWZhu, ZMandal, MWu, YCumming, JNLiu, XLi, GIserloh, U Phenyl-substituted 2-imino-3-methyl pyrrolo pyrimidinone compounds as BACE-1 inhibitors, compositions, and their use US Patent US8541427 Publication Date 9/24/2013
 
Beta-secretase 1
Name:Beta-secretase 1
Type:Protein
Mol. Mass.:55755.10
Organism:Homo sapiens (Human)
Description:P56817
Residue:501
BDBM9489
NameBDBM9489
Synonyms:US8541427, 2
Typen/a
Emp. Form.C19H19ClF2N6O2
Mol. Mass.436.843
SMILESCOc1nc(nc(C)c1F)N1C[C@H]2C(=O)N(C)C(=N)N[C@]2(C1)c1cc(F)ccc1Cl