Reaction Details
TargetBeta-secretase 1
LigandBDBM102944
Substrate/Competitorn/a
Meas. Tech.Time-Resolved FRET Assay
Temperature303.15±0 K
Ki 7.3±0.0 nM
IC50 23±0.0 nM
Citation Stamford, AWZhu, ZMandal, MWu, YCumming, JNLiu, XLi, GIserloh, U Phenyl-substituted 2-imino-3-methyl pyrrolo pyrimidinone compounds as BACE-1 inhibitors, compositions, and their use US Patent US8541427 Publication Date 9/24/2013
 
Beta-secretase 1
Name:Beta-secretase 1
Type:Protein
Mol. Mass.:55755.10
Organism:Homo sapiens (Human)
Description:P56817
Residue:501
BDBM102944
NameBDBM102944
Synonyms:US8541427, 15 US8541427, 44 | US8541427, 45
TypeSmall organic molecule
Emp. Form.C19H19F3N6O2
Mol. Mass.420.3884
SMILESCOc1nc(nc(C)c1F)N1C[C@H]2C(=O)N(C)C(N)=N[C@]2(C1)c1cc(F)ccc1F