Reaction Details
TargetPeptidase 1
LigandBDBM103023
Substrate/Competitorn/a
Meas. Tech.Enzyme Activity Assay
IC50 6.3±0.0 nM
Citation Robinson, CZhang, JGarrod, DRPerrior, TRNewton, GKJenkins, KBeevers, REMajor, MRStewart, MR Pyruvamide compounds as inhibitors of dust mite group 1 peptidase allergen and their use US Patent US8541363 Publication Date 9/24/2013
 
Peptidase 1
Name:Peptidase 1
Type:Enzyme
Mol. Mass.:36101.04
Organism:Dermatophagoides pteronyssinus (European house dust mite)
Description:P08176
Residue:320
BDBM103023
NameBDBM103023
Synonyms:US8541363, PVA-039
TypeSmall organic molecule
Emp. Form.C28H43N5O5
Mol. Mass.529.6715
SMILESCCCC[C@H](NC(=O)[C@H](C)NC(=O)[C@@H](NC(=O)c1ccncc1)C(C)(C)C)C(=O)C(=O)NC1CCCCC1