Reaction Details
TargetAdhesin Ata autotransporter
LigandBDBM281038
Substrate/Competitorn/a
Meas. Tech.Antimicrobial Susceptibility Testing Assay
IC50<100.0±n/a nM
Citation Alanine, ABeignet, JBleicher, KFasching, BHilpert, HHu, TMacDonald, DJackson, SKolczewski, SKroll, CSchaeublin, AShen, HStoll, TThomas, HWahhab, AZampaloni, C Peptide macrocycles against acinetobacter baumannii US Patent US10030047 Publication Date 7/24/2018
 
Adhesin Ata autotransporter
Name:Adhesin Ata autotransporter
Type:Enzyme Catalytic Domain
Mol. Mass.:189662.81
Organism:Acinetobacter baumannii (strain ATCC 17978 / CIP 53.77 / LMG 1025 / NCDC KC755 / 5377)
Description:A3M3H0
Residue:1873
BDBM281038
NameBDBM281038
Synonyms:4-[(11S,14S,17S)-14-(4-Amino-butyl)-11-(3-amino-propyl)-25-chloro-17-(1H-indol-3-ylmethyl)-16-methyl-12,15,18-trioxo-2-thia-4,10,13,16,19-pentaaza-tricyclo[19.4.0.0*3,8*]pentacosa-1(25),3(8),4,6,21,23-hexaen-22-yl]-N-(2-hydroxy-ethyl)-benzamide | US10030047, Example 247
TypeSmall organic molecule
Emp. Form.C45H54ClN9O5S
Mol. Mass.868.486
SMILESCN1[C@@H](Cc2c[nH]c3ccccc23)C(=O)NCc2c(Sc3ncccc3CN[C@@H](CCCN)C(=O)N[C@@H](CCCCN)C1=O)c(Cl)ccc2-c1ccc(cc1)C(=O)NCCO