Reaction Details
TargetAdhesin Ata autotransporter
LigandBDBM281042
Substrate/Competitorn/a
Meas. Tech.Antimicrobial Susceptibility Testing Assay
IC50<100.0±n/a nM
Citation Alanine, ABeignet, JBleicher, KFasching, BHilpert, HHu, TMacDonald, DJackson, SKolczewski, SKroll, CSchaeublin, AShen, HStoll, TThomas, HWahhab, AZampaloni, C Peptide macrocycles against acinetobacter baumannii US Patent US10030047 Publication Date 7/24/2018
 
Adhesin Ata autotransporter
Name:Adhesin Ata autotransporter
Type:Enzyme Catalytic Domain
Mol. Mass.:189662.81
Organism:Acinetobacter baumannii (strain ATCC 17978 / CIP 53.77 / LMG 1025 / NCDC KC755 / 5377)
Description:A3M3H0
Residue:1873
BDBM281042
NameBDBM281042
Synonyms:(11S,14S,17S)-11-(3-Amino-propyl)-23,25-dichloro-17-(1H-indol-3-ylmethyl)-16-methyl-14-(4-methylamino-butyl)-2-thia-4,10,13,16,19-pentaaza-tricyclo[19.4.0.0*3,8*]pentacosa-1(25),3(8),4,6,21,23-hexaene-12,15,18-trione | US10030047, Example 251
TypeSmall organic molecule
Emp. Form.C37H46Cl2N8O3S
Mol. Mass.753.784
SMILESCNCCCC[C@@H]1NC(=O)[C@H](CCCN)NCc2cccnc2Sc2c(Cl)cc(Cl)cc2CNC(=O)[C@H](Cc2c[nH]c3ccccc23)N(C)C1=O