Reaction Details
TargetGenome polyprotein
LigandBDBM103284
Substrate/Competitorn/a
Meas. Tech.Inhibition Assay
IC50 3.6e+2±n/a nM
Citation Halim, RHarding, MHufton, RMorton, CJJahangiri, SPool, BRJeynes, TPDraffan, AGFrey, BLilly, MJ Viral polymerase inhibitors US Patent US8546389 Publication Date 10/1/2013
 
Genome polyprotein
Name:Genome polyprotein
Type:Protein
Mol. Mass.:327252.46
Organism:Hepatitis C virus genotype 1b (isolate BK) (HCV)
Description:P26663
Residue:3010
BDBM103284
NameBDBM103284
Synonyms:US8546389, 54
TypeSmall organic molecule
Emp. Form.C22H25ClN4O4S
Mol. Mass.476.976
SMILESCNC(=O)c1n(nc2cc(N(CCCO)S(C)(=O)=O)c(cc12)C1CC1)-c1ccc(Cl)cc1