Reaction Details
TargetGenome polyprotein
LigandBDBM103286
Substrate/Competitorn/a
Meas. Tech.Inhibition Assay
IC50 1.8e+2±n/a nM
Citation Halim, RHarding, MHufton, RMorton, CJJahangiri, SPool, BRJeynes, TPDraffan, AGFrey, BLilly, MJ Viral polymerase inhibitors US Patent US8546389 Publication Date 10/1/2013
 
Genome polyprotein
Name:Genome polyprotein
Type:Protein
Mol. Mass.:327252.46
Organism:Hepatitis C virus genotype 1b (isolate BK) (HCV)
Description:P26663
Residue:3010
BDBM103286
NameBDBM103286
Synonyms:US8546389, 62
TypeSmall organic molecule
Emp. Form.C27H32BrN5O4S
Mol. Mass.602.543
SMILESCNC(=O)c1n(nc2cc(N(CCCNC(=O)C3CCC3)S(C)(=O)=O)c(cc12)C1CC1)-c1ccc(Br)cc1