Reaction Details
TargetGenome polyprotein
LigandBDBM103264
Substrate/Competitorn/a
Meas. Tech.Inhibition Assay
IC50 7e+1±n/a nM
Citation Halim, RHarding, MHufton, RMorton, CJJahangiri, SPool, BRJeynes, TPDraffan, AGFrey, BLilly, MJ Viral polymerase inhibitors US Patent US8546389 Publication Date 10/1/2013
 
Genome polyprotein
Name:Genome polyprotein
Type:Protein
Mol. Mass.:327252.46
Organism:Hepatitis C virus genotype 1b (isolate BK) (HCV)
Description:P26663
Residue:3010
BDBM103264
NameBDBM103264
Synonyms:US8546389, 160
TypeSmall organic molecule
Emp. Form.C27H28BrN5O5S
Mol. Mass.614.511
SMILESCNC(=O)c1n(nc2cc(N(CCCNC(=O)c3ccoc3)S(C)(=O)=O)c(cc12)C1CC1)-c1ccc(Br)cc1