Reaction Details
TargetGenome polyprotein
LigandBDBM103265
Substrate/Competitorn/a
Meas. Tech.Inhibition Assay
IC50 5.2e+2±n/a nM
Citation Halim, RHarding, MHufton, RMorton, CJJahangiri, SPool, BRJeynes, TPDraffan, AGFrey, BLilly, MJ Viral polymerase inhibitors US Patent US8546389 Publication Date 10/1/2013
 
Genome polyprotein
Name:Genome polyprotein
Type:Protein
Mol. Mass.:327252.46
Organism:Hepatitis C virus genotype 1b (isolate BK) (HCV)
Description:P26663
Residue:3010
BDBM103265
NameBDBM103265
Synonyms:US8546389, 164
TypeSmall organic molecule
Emp. Form.C28H34BrN5O6S
Mol. Mass.648.568
SMILESCCOC(=O)CCC(=O)NCCCN(c1cc2nn(c(C(=O)NC)c2cc1C1CC1)-c1ccc(Br)cc1)S(C)(=O)=O