Reaction Details
TargetGenome polyprotein
LigandBDBM103256
Substrate/Competitorn/a
Meas. Tech.Inhibition Assay
IC50 2e+1±n/a nM
Citation Halim, RHarding, MHufton, RMorton, CJJahangiri, SPool, BRJeynes, TPDraffan, AGFrey, BLilly, MJ Viral polymerase inhibitors US Patent US8546389 Publication Date 10/1/2013
 
Genome polyprotein
Name:Genome polyprotein
Type:Protein
Mol. Mass.:329637.29
Organism:Hepatitis C virus genotype 3a (isolate NZL1) (HCV)
Description:Q81258
Residue:3021
BDBM103256
NameBDBM103256
Synonyms:US8546389, 28
TypeSmall organic molecule
Emp. Form.C27H27FN4O4S
Mol. Mass.522.591
SMILESCCN(c1cc2nn(c(C(=O)NC)c2cc1C1CC1)-c1ccc(Oc2ccccc2F)cc1)S(C)(=O)=O