Reaction Details
TargetGenome polyprotein
LigandBDBM103266
Substrate/Competitorn/a
Meas. Tech.Inhibition Assay
IC50 3e+1±n/a nM
Citation Halim, RHarding, MHufton, RMorton, CJJahangiri, SPool, BRJeynes, TPDraffan, AGFrey, BLilly, MJ Viral polymerase inhibitors US Patent US8546389 Publication Date 10/1/2013
 
Genome polyprotein
Name:Genome polyprotein
Type:Protein
Mol. Mass.:329637.29
Organism:Hepatitis C virus genotype 3a (isolate NZL1) (HCV)
Description:Q81258
Residue:3021
BDBM103266
NameBDBM103266
Synonyms:US8546389, 166
TypeSmall organic molecule
Emp. Form.C29H30BrN5O4S
Mol. Mass.624.549
SMILESCNC(=O)c1n(nc2cc(N(CCCNC(=O)c3ccccc3)S(C)(=O)=O)c(cc12)C1CC1)-c1ccc(Br)cc1