Reaction Details
TargetGenome polyprotein
LigandBDBM103268
Substrate/Competitorn/a
Meas. Tech.Inhibition Assay
IC50 4e+1±n/a nM
Citation Halim, RHarding, MHufton, RMorton, CJJahangiri, SPool, BRJeynes, TPDraffan, AGFrey, BLilly, MJ Viral polymerase inhibitors US Patent US8546389 Publication Date 10/1/2013
 
Genome polyprotein
Name:Genome polyprotein
Type:Protein
Mol. Mass.:329637.29
Organism:Hepatitis C virus genotype 3a (isolate NZL1) (HCV)
Description:Q81258
Residue:3021
BDBM103268
NameBDBM103268
Synonyms:US8546389, 172
TypeSmall organic molecule
Emp. Form.C24H25BrF3N5O4S
Mol. Mass.616.451
SMILESCNC(=O)c1n(nc2cc(N(CCCNC(=O)C(F)(F)F)S(C)(=O)=O)c(cc12)C1CC1)-c1ccc(Br)cc1