Reaction Details
TargetKinesin-like protein KIF11
LigandBDBM103306
Substrate/Competitorn/a
Meas. Tech.In Vitro Assay
pH7.5±0
Temperature310.15±0 K
IC50 0.74±0.0 nM
Citation Abrams, TBarsanti, PDing, YDuhl, DHan, WHu, CPan, Y Triazole compounds as KSP inhibitors US Patent US8546434 Publication Date 10/1/2013
 
Kinesin-like protein KIF11
Name:Kinesin-like protein KIF11
Type:PROTEIN
Mol. Mass.:119138.97
Organism:Homo sapiens (Human)
Description:ChEMBL_1457426
Residue:1056
BDBM103306
NameBDBM103306
Synonyms:US8546434, 3
TypeSmall organic molecule
Emp. Form.C32H40F4N6O2
Mol. Mass.616.6926
SMILESC[C@H]1CN(C[C@@H](C)O1)C(=O)N(C[C@@H]1CNC[C@@H]1F)[C@@H](c1nc(nn1Cc1cccc(F)c1)-c1cc(F)ccc1F)C(C)(C)C