Reaction Details
TargetKinesin-like protein KIF11
LigandBDBM103308
Substrate/Competitorn/a
Meas. Tech.In Vitro Assay
pH7.5±0
Temperature310.15±0 K
IC50 1.46±0.0 nM
Citation Abrams, TBarsanti, PDing, YDuhl, DHan, WHu, CPan, Y Triazole compounds as KSP inhibitors US Patent US8546434 Publication Date 10/1/2013
 
Kinesin-like protein KIF11
Name:Kinesin-like protein KIF11
Type:PROTEIN
Mol. Mass.:119138.97
Organism:Homo sapiens (Human)
Description:ChEMBL_1457426
Residue:1056
BDBM103308
NameBDBM103308
Synonyms:US8546434, 5
TypeSmall organic molecule
Emp. Form.C30H35F4N5O2
Mol. Mass.573.6248
SMILESCC(C)(C)[C@@H](N(C[C@@H]1CNC[C@@H]1F)C(=O)C1CCCO1)c1nc(nn1Cc1cccc(F)c1)-c1cc(F)ccc1F