Reaction Details
TargetCathepsin L2
LigandBDBM103355
Substrate/Competitorn/a
Meas. Tech.In Vitro Inhibition Assay
Ki>10000±0.0 nM
Citation Quibell, MWatts, JPFlinn, NS Furo[3, 2-B] pyrrol-3-ones as cathespin S inhibitors US Patent US8552202 Publication Date 10/8/2013
 
Cathepsin L2
Name:Cathepsin L2
Type:Enzyme
Mol. Mass.:37341.06
Organism:Homo sapiens (Human)
Description:O60911
Residue:334
BDBM103355
NameBDBM103355
Synonyms:US8552202, Compound 6
TypeSmall organic molecules
Emp. Form.C22H27ClN2O4
Mol. Mass.418.914
SMILESC[C@H]1CC[C@@H](CC1)[C@H](NC(=O)c1ccccc1)C(=O)N1C[C@@H](Cl)[C@H]2OCC(=O)[C@@H]12