Reaction Details
TargetCathepsin L2
LigandBDBM103357
Substrate/Competitorn/a
Meas. Tech.In Vitro Inhibition Assay
Ki 2000±0.0 nM
Citation Quibell, MWatts, JPFlinn, NS Furo[3, 2-B] pyrrol-3-ones as cathespin S inhibitors US Patent US8552202 Publication Date 10/8/2013
 
Cathepsin L2
Name:Cathepsin L2
Type:Enzyme
Mol. Mass.:37341.06
Organism:Homo sapiens (Human)
Description:O60911
Residue:334
BDBM103357
NameBDBM103357
Synonyms:US8552202, Compound 8
TypeSmall organic molecules
Emp. Form.C22H25FN6O4
Mol. Mass.456.4701
SMILESF[C@H]1CN([C@H]2[C@@H]1OCC2=O)C(=O)[C@@H](NC(=O)c1cccc(c1)-n1cnnn1)C1CCCCC1