Reaction Details
TargetCalcitonin gene-related peptide type 1 receptor
LigandBDBM103494
Substrate/Competitorn/a
Meas. Tech.Native Receptor Binding Assay
pH7.4±0
Ki 0.065±0.0 nM
Citation Wood, MRKim, JJSelnick, HGStachel, SJ Non-amidic linkers with branched termini as CGRP receptor antagonists US Patent US8552023 Publication Date 10/8/2013
 
Calcitonin gene-related peptide type 1 receptor
Name:Calcitonin gene-related peptide type 1 receptor
Type:Enzyme Catalytic Domain
Mol. Mass.:52980.45
Organism:Homo sapiens (Human)
Description:Q16602
Residue:461
BDBM103494
NameBDBM103494
Synonyms:US8552023, 6
TypeSmall organic molecule
Emp. Form.C30H29ClF2N4O2
Mol. Mass.551.027
SMILESC[C@@H](N(C\C=C\c1cnc2C[C@]3(Cc2c1)C(=O)Nc1ncccc31)C(=O)C(C)(C)CCl)c1cc(F)cc(F)c1