Reaction Details
TargetCalcitonin gene-related peptide type 1 receptor
LigandBDBM103499
Substrate/Competitorn/a
Meas. Tech.Native Receptor Binding Assay
pH7.4±0
Ki 0.05±0.0 nM
Citation Wood, MRKim, JJSelnick, HGStachel, SJ Non-amidic linkers with branched termini as CGRP receptor antagonists US Patent US8552023 Publication Date 10/8/2013
 
Calcitonin gene-related peptide type 1 receptor
Name:Calcitonin gene-related peptide type 1 receptor
Type:Enzyme Catalytic Domain
Mol. Mass.:52980.45
Organism:Homo sapiens (Human)
Description:Q16602
Residue:461
BDBM103499
NameBDBM103499
Synonyms:US8552023, 11
TypeSmall organic molecule
Emp. Form.C30H25F5N4O2
Mol. Mass.568.5371
SMILESC[C@@H](N(C\C=C\c1cnc2C[C@]3(Cc2c1)C(=O)Nc1ncccc31)C(=O)C1(CC1)C(F)(F)F)c1cc(F)cc(F)c1