Reaction Details
TargetTyrosine-protein kinase ZAP-70
LigandBDBM103518
Substrate/Competitorn/a
Meas. Tech.Enzyme Assay
IC50 78±n/a nM
Citation Okram, BUno, TDing, QLiu, YJin, YJin, QWu, XChe, JYan, SFHao, X Compounds and compositions as kinase inhibitors US Patent US8546370 Publication Date 10/1/2013
 
Tyrosine-protein kinase ZAP-70
Name:Tyrosine-protein kinase ZAP-70
Type:Enzyme
Mol. Mass.:69881.61
Organism:Homo sapiens (Human)
Description:ZAP-70 SH2 domain was expressed and purified from E. coli using O-phospho-L-tyrosine-agarose column.
Residue:619
BDBM103518
NameBDBM103518
Synonyms:US8546370, 151
TypeSmall organic molecule
Emp. Form.C21H18N6O2
Mol. Mass.386.4066
SMILESCN(C)C(=O)c1ccc(Nc2nc(cc3cc[nH]c(=O)c23)-c2cncnc2)cc1