Reaction Details
TargetTyrosine-protein kinase ZAP-70
LigandBDBM103532
Substrate/Competitorn/a
Meas. Tech.Enzyme Assay
IC50 48±n/a nM
Citation Okram, BUno, TDing, QLiu, YJin, YJin, QWu, XChe, JYan, SFHao, X Compounds and compositions as kinase inhibitors US Patent US8546370 Publication Date 10/1/2013
 
Tyrosine-protein kinase ZAP-70
Name:Tyrosine-protein kinase ZAP-70
Type:Enzyme
Mol. Mass.:69881.61
Organism:Homo sapiens (Human)
Description:ZAP-70 SH2 domain was expressed and purified from E. coli using O-phospho-L-tyrosine-agarose column.
Residue:619
BDBM103532
NameBDBM103532
Synonyms:US8546370, 1124
TypeSmall organic molecule
Emp. Form.C17H16N8O
Mol. Mass.348.3619
SMILESCn1cc(Nc2nc(cc3ccn(C)c(=O)c23)-c2cnc(N)nc2)cn1