Reaction Details
TargetTyrosine-protein kinase ZAP-70
LigandBDBM103527
Substrate/Competitorn/a
Meas. Tech.Enzyme Assay
IC50 79±n/a nM
Citation Okram, BUno, TDing, QLiu, YJin, YJin, QWu, XChe, JYan, SFHao, X Compounds and compositions as kinase inhibitors US Patent US8546370 Publication Date 10/1/2013
 
Tyrosine-protein kinase ZAP-70
Name:Tyrosine-protein kinase ZAP-70
Type:Enzyme
Mol. Mass.:69881.61
Organism:Homo sapiens (Human)
Description:ZAP-70 SH2 domain was expressed and purified from E. coli using O-phospho-L-tyrosine-agarose column.
Residue:619
BDBM103527
NameBDBM103527
Synonyms:US8546370, 589
TypeSmall organic molecule
Emp. Form.C27H28N6O
Mol. Mass.452.5508
SMILESCc1cc(Nc2nc(cc3cc[nH]c(=O)c23)-c2cncnc2)ccc1C1CCN(CC1)C1CC1